Reaction Details
TargetD(3) dopamine receptor
LigandBDBM50072822
Substrate/Competitorn/a
Meas. Tech.ChEMBL_62131 (CHEMBL674521)
Ki 5.4±n/a nM
Citation Bolós, JAnglada, LGubert, SPlanas, JMAgut, JPríncep, MDe la Fuente, NSacristán, AOrtiz, JA 7-[3-(1-piperidinyl)propoxy]chromenones as potential atypical antipsychotics. 2. Pharmacological profile of 7-[3-[4-(6-fluoro-1, 2-benzisoxazol-3-yl)-piperidin-1-yl]propoxy]-3-(hydroxymeth yl)chromen -4-one (abaperidone, FI-8602). J Med Chem41:5402-9 (1999) 
 
D(3) dopamine receptor
Name:D(3) dopamine receptor
Type:n/a
Mol. Mass.:44243.43
Organism:Homo sapiens (Human)
Description:n/a
Residue:400
BDBM50072822
NameBDBM50072822
Synonyms:7-{3-[4-(6-Fluoro-benzo[d]isoxazol-3-yl)-piperidin-1-yl]-propoxy}-3-hydroxymethyl-chromen-4-one | CHEMBL151475
TypeSmall organic molecule
Emp. Form.C25H25FN2O5
Mol. Mass.452.4748
SMILESOCc1coc2cc(OCCCN3CCC(CC3)c3noc4cc(F)ccc34)ccc2c1=O