Reaction Details
Target5-hydroxytryptamine receptor 1A
LigandBDBM50073028
Substrate/Competitorn/a
Meas. Tech.ChEMBL_1459 (CHEMBL616582)
Ki 21.2±n/a nM
Citation Barlocco, DCignarella, GMontesano, FLeonardi, AMella, MToma, L Novel adrenoceptor antagonists with a tricyclic pyrrolodipyridazine skeleton. J Med Chem42:173-7 (1999) 
 
5-hydroxytryptamine receptor 1A
Name:5-hydroxytryptamine receptor 1A
Type:G Protein-Coupled Receptor (GPCR)
Mol. Mass.:46445.29
Organism:Rattus norvegicus (rat)
Description:Binding assays were performed using rat hippocampal membranes.
Residue:422
BDBM50073028
NameBDBM50073028
Synonyms:8-Chloro-6-methyl-2-[2-(4-phenyl-piperazin-1-yl)-ethylamino]-6H-1,6,7,9a-tetraaza-fluoren-5-one | CHEMBL51074
TypeSmall organic molecule
Emp. Form.C22H24ClN7O
Mol. Mass.437.925
SMILESCn1nc(Cl)c2cn3nc(NCCN4CCN(CC4)c4ccccc4)ccc3c2c1=O