Reaction Details
TargetNeuropeptide Y receptor type 5
LigandBDBM50073048
Substrate/Competitorn/a
Meas. Tech.ChEMBL_144139 (CHEMBL750754)
IC50 0.47±n/a nM
Citation Kordik, CPReitz, AB Pharmacological treatment of obesity: therapeutic strategies. J Med Chem42:181-201 (1999) 
 
Neuropeptide Y receptor type 5
Name:Neuropeptide Y receptor type 5
Type:Enzyme
Mol. Mass.:50746.64
Organism:Homo sapiens (Human)
Description:Q15761
Residue:445
BDBM50073048
NameBDBM50073048
Synonyms:2-[4-(2-Oxo-2,3-dihydro-benzoimidazol-1-yl)-piperidin-1-yl]-N-(9-oxo-9H-fluoren-3-yl)-acetamide | CHEMBL62166
TypeSmall organic molecule
Emp. Form.C27H24N4O3
Mol. Mass.452.5045
SMILESO=C(CN1CCC(CC1)n1c2ccccc2[nH]c1=O)Nc1ccc2C(=O)c3ccccc3-c2c1