Reaction Details
TargetBeta-2 adrenergic receptor
LigandBDBM50518984
Substrate/Competitorn/a
Meas. Tech.ChEMBL_1873771 (CHEMBL4375060)
Ki 0.380189±n/a nM
Citation Gaiser, BIDanielsen, MMarcher-Rørsted, ERøpke Jørgensen, KWróbel, TMFrykman, MJohansson, HBräuner-Osborne, HGloriam, DEMathiesen, JMSejer Pedersen, D Probing the Existence of a Metastable Binding Site at the ? J Med Chem62:7806-7839 (2019) 
 
Beta-2 adrenergic receptor
Name:Beta-2 adrenergic receptor
Type:n/a
Mol. Mass.:46461.69
Organism:Homo sapiens (Human)
Description:P07550
Residue:413
BDBM50518984
NameBDBM50518984
Synonyms:CHEMBL4564189
TypeSmall organic molecule
Emp. Form.C33H54N4O5
Mol. Mass.586.8057
SMILESCC(C)NC[C@H](O)COc1ccccc1CCCCNC(=O)NCCCCc1ccccc1OC[C@@H](O)CNC(C)C