Reaction Details
TargetApoptosis regulator Bcl-2
LigandBDBM50519047
Substrate/Competitorn/a
Meas. Tech.ChEMBL_1873796 (CHEMBL4375085)
Ki 1300±n/a nM
Citation Szlávik, ZOndi, LCsékei, MPaczal, ASzabó, ZBRadics, GMurray, JDavidson, JChen, IDavis, BHubbard, REPedder, CDokurno, PSurgenor, ASmith, JRobertson, ALeToumelin-Braizat, GCauquil, NZarka, MDemarles, DPerron-Sierra, FClaperon, AColland, FGeneste, OKotschy, A Structure-Guided Discovery of a Selective Mcl-1 Inhibitor with Cellular Activity. J Med Chem62:6913-6924 (2019) 
 
Apoptosis regulator Bcl-2
Name:Apoptosis regulator Bcl-2
Type:Homodimer or heterodimer
Mol. Mass.:26269.11
Organism:Homo sapiens (Human)
Description:P10415
Residue:239
BDBM50519047
NameBDBM50519047
Synonyms:CHEMBL4521569
TypeSmall organic molecule
Emp. Form.C31H29FN4O5S2
Mol. Mass.620.714
SMILESCCNS(=O)(=O)c1cccc(c1)-c1nc(N[C@H](C)C(O)=O)c2c(c(CC)sc2n1)-c1cccc(Oc2ccc(F)cc2)c1