Reaction Details
TargetInduced myeloid leukemia cell differentiation protein Mcl-1
LigandBDBM50519050
Substrate/Competitorn/a
Meas. Tech.ChEMBL_1873795 (CHEMBL4375084)
Ki 21±n/a nM
Citation Szlávik, ZOndi, LCsékei, MPaczal, ASzabó, ZBRadics, GMurray, JDavidson, JChen, IDavis, BHubbard, REPedder, CDokurno, PSurgenor, ASmith, JRobertson, ALeToumelin-Braizat, GCauquil, NZarka, MDemarles, DPerron-Sierra, FClaperon, AColland, FGeneste, OKotschy, A Structure-Guided Discovery of a Selective Mcl-1 Inhibitor with Cellular Activity. J Med Chem62:6913-6924 (2019) 
 
Induced myeloid leukemia cell differentiation protein Mcl-1
Name:Induced myeloid leukemia cell differentiation protein Mcl-1
Type:Membrane; Single-pass membrane protein
Mol. Mass.:37332.87
Organism:Homo sapiens (Human)
Description:Q07820
Residue:350
BDBM50519050
NameBDBM50519050
Synonyms:CHEMBL4465591
TypeSmall organic molecule
Emp. Form.C31H33ClN4O5S
Mol. Mass.609.136
SMILESCCc1sc2ncnc(O[C@H](Cc3ccccc3)C(O)=O)c2c1-c1ccc(OCC(=O)N2CCN(C)CC2)c(Cl)c1C