Reaction Details
TargetInduced myeloid leukemia cell differentiation protein Mcl-1
LigandBDBM50519052
Substrate/Competitorn/a
Meas. Tech.ChEMBL_1873795 (CHEMBL4375084)
Ki 51±n/a nM
Citation Szlávik, ZOndi, LCsékei, MPaczal, ASzabó, ZBRadics, GMurray, JDavidson, JChen, IDavis, BHubbard, REPedder, CDokurno, PSurgenor, ASmith, JRobertson, ALeToumelin-Braizat, GCauquil, NZarka, MDemarles, DPerron-Sierra, FClaperon, AColland, FGeneste, OKotschy, A Structure-Guided Discovery of a Selective Mcl-1 Inhibitor with Cellular Activity. J Med Chem62:6913-6924 (2019) 
 
Induced myeloid leukemia cell differentiation protein Mcl-1
Name:Induced myeloid leukemia cell differentiation protein Mcl-1
Type:Membrane; Single-pass membrane protein
Mol. Mass.:37332.87
Organism:Homo sapiens (Human)
Description:Q07820
Residue:350
BDBM50519052
NameBDBM50519052
Synonyms:CHEMBL4515048
TypeSmall organic molecule
Emp. Form.C24H21ClN2O4S
Mol. Mass.468.953
SMILESCCc1sc2ncnc(O[C@H](Cc3ccccc3)C(O)=O)c2c1-c1ccc(O)c(Cl)c1C