Reaction Details
TargetKelch-like ECH-associated protein 1
LigandBDBM50180850
Substrate/Competitorn/a
Meas. Tech.ChEMBL_1874773 (CHEMBL4376062)
Kd 1.4±n/a nM
Citation Tran, KTPallesen, JSSolbak, SMØNarayanan, DBaig, AZang, JAguayo-Orozco, ACarmona, RMCGarcia, ADBach, A A Comparative Assessment Study of Known Small-Molecule Keap1-Nrf2 Protein-Protein Interaction Inhibitors: Chemical Synthesis, Binding Properties, and Cellular Activity. J Med Chem62:8028-8052 (2019) 
 
Kelch-like ECH-associated protein 1
Name:Kelch-like ECH-associated protein 1
Type:PROTEIN
Mol. Mass.:69664.53
Organism:Homo sapiens (Human)
Description:ChEMBL_107924
Residue:624
BDBM50180850
NameBDBM50180850
Synonyms:CHEMBL3819587
TypeSmall organic molecule
Emp. Form.C28H30N4O6S
Mol. Mass.550.626
SMILESCOc1cc(cc2nnn(C)c12)[C@@H](CC(O)=O)c1ccc(C)c(CN2C[C@@H](C)Oc3ccccc3S2(=O)=O)c1