Reaction Details
TargetSodium-dependent dopamine transporter
LigandBDBM50073438
Substrate/Competitorn/a
Meas. Tech.ChEMBL_61685 (CHEMBL671770)
Ki>10000±n/a nM
Citation Oya, SKung, MPActon, PDMu, MHou, CKung, HF A new single-photon emission computed tomography imaging agent for serotonin transporters: [123I]IDAM, 5-iodo-2-((2-((dimethylamino)methyl)phenyl)thio)benzyl alcohol. J Med Chem42:333-5 (1999) 
 
Sodium-dependent dopamine transporter
Name:Sodium-dependent dopamine transporter
Type:Multi-pass membrane protein
Mol. Mass.:68497.11
Organism:Homo sapiens (Human)
Description:Q01959
Residue:620
BDBM50073438
NameBDBM50073438
Synonyms:CHEMBL278165 | [5-Bromo-2-(2-dimethylaminomethyl-phenylsulfanyl)-phenyl]-methanol
TypeSmall organic molecule
Emp. Form.C16H18BrNOS
Mol. Mass.352.289
SMILESCN(C)Cc1ccccc1Sc1ccc(Br)cc1CO