Reaction Details
TargetPurine nucleoside phosphorylase
LigandBDBM50293087
Substrate/Competitorn/a
Meas. Tech.ChEMBL_1875751 (CHEMBL4377145)
Ki 0.160000±n/a nM
Citation Cheviet, TLefebvre-Tournier, IWein, SPeyrottes, S Plasmodium Purine Metabolism and Its Inhibition by Nucleoside and Nucleotide Analogues. J Med Chem62:8365-8391 (2019) 
 
Purine nucleoside phosphorylase
Name:Purine nucleoside phosphorylase
Type:Enzyme
Mol. Mass.:32119.53
Organism:Homo sapiens (Human)
Description:n/a
Residue:289
BDBM50293087
NameBDBM50293087
Synonyms:2-amino-7-(((3R,4R)-3-hydroxy-4-(hydroxymethyl)pyrrolidin-1-yl)methyl)-3H-pyrrolo[3,2-d]pyrimidin-4(5H)-one | CHEMBL475750
TypeSmall organic molecule
Emp. Form.C12H17N5O3
Mol. Mass.279.2951
SMILESNc1nc2c(CN3C[C@H](O)[C@@H](CO)C3)c[nH]c2c(=O)[nH]1