Reaction Details
TargetDelta-type opioid receptor
LigandBDBM50001468
Substrate/Competitorn/a
Meas. Tech.ChEMBL_146338 (CHEMBL753787)
Ki 0.8±n/a nM
Citation Negri, LLattanzi, RTabacco, FOrrù, LSeverini, CScolaro, BRocchi, R Dermorphin and deltorphin glycosylated analogues: synthesis and antinociceptive activity after systemic administration. J Med Chem42:400-4 (1999) 
 
Delta-type opioid receptor
Name:Delta-type opioid receptor
Type:Enzyme Catalytic Domain
Mol. Mass.:40577.25
Organism:MOUSE
Description:P32300
Residue:372
BDBM50001468
NameBDBM50001468
Synonyms:(S)-3-((S)-2-{(R)-2-[(S)-2-Amino-3-(4-hydroxy-phenyl)-propionylamino]-propionylamino}-3-phenyl-propionylamino)-N-{(S)-1-[(S)-1-(carbamoylmethyl-carbamoyl)-2-methyl-propylcarbamoyl]-2-methyl-propyl}-succinamic acid CHEMBL317956 deltorphin C
TypeSmall organic molecule
Emp. Form.C37H52N8O10
Mol. Mass.768.8564
SMILESCC(C)[C@H](NC(=O)[C@@H](NC(=O)[C@H](CC(O)=O)NC(=O)[C@H](Cc1ccccc1)NC(=O)[C@@H](C)NC(=O)[C@@H](N)Cc1ccc(O)cc1)C(C)C)C(=O)NCC(N)=O