Reaction Details
TargetTau-tubulin kinase 2
LigandBDBM50519662
Substrate/Competitorn/a
Meas. Tech.ChEMBL_1878083 (CHEMBL4379477)
IC50>10000±n/a nM
Citation Zhao, LLi, YWang, YQiao, ZMiao, ZYang, JHuang, LTian, CLi, LChen, DYang, S Discovery of 4 J Med Chem62:10691-10710 (2019) 
 
Tau-tubulin kinase 2
Name:Tau-tubulin kinase 2
Type:PROTEIN
Mol. Mass.:137421.41
Organism:Homo sapiens (Human)
Description:ChEMBL_109480
Residue:1244
BDBM50519662
NameBDBM50519662
Synonyms:CHEMBL4438748
TypeSmall organic molecule
Emp. Form.C26H23N3O5
Mol. Mass.457.4779
SMILESCN(C)c1ccc(cc1)C(=O)Nc1cccc(NC(=O)COc2ccc3c(c2)occc3=O)c1