Reaction Details
TargetProtein kinase C alpha type
LigandBDBM50073877
Substrate/Competitorn/a
Meas. Tech.ChEBML_160134
Ki>500±n/a nM
Citation Endo, YShimazu, MFukasawa, HDriedger, PEKimura, KTomioka, NItai, AShudo, K Synthesis, computer modeling and biological evaluation of novel protein kinase C agonists based on a 7-membered lactam moiety. Bioorg Med Chem Lett9:173-8 (1999) Protein kinase C alpha type
Name:Protein kinase C alpha type
Type:Enzyme
Mol. Mass.:76755.65
Organism:Homo sapiens (Human)
Description:The recombinant human PKC enzymes were produced using a baculovirus expression system in SF9 cells
Residue:672
BDBM50073877
NameBDBM50073877
Synonyms:(4S,5aS,5bS,7aR,8R,10aS,10bR,12aS)-8-(1,5-Dimethyl-hexyl)-4-hydroxymethyl-5a,7a-dimethyl-hexadecahydro-cyclopenta[5,6]naphtho[1,2-d]azepin-2-one | CHEMBL301704
TypeSmall organic molecule
Emp. Form.C28H49NO2
Mol. Mass.431.6942
SMILESCC(C)CCCC(C)[C@H]1CC[C@H]2[C@@H]3CC[C@H]4CC(=O)N[C@H](CO)C[C@]4(C)[C@H]3CC[C@]12C