Reaction Details
TargetProtein kinase C alpha type
LigandBDBM50073874
Substrate/Competitorn/a
Meas. Tech.ChEBML_160134
Ki 60±n/a nM
Citation Endo, YShimazu, MFukasawa, HDriedger, PEKimura, KTomioka, NItai, AShudo, K Synthesis, computer modeling and biological evaluation of novel protein kinase C agonists based on a 7-membered lactam moiety. Bioorg Med Chem Lett9:173-8 (1999) Protein kinase C alpha type
Name:Protein kinase C alpha type
Type:Enzyme
Mol. Mass.:76755.65
Organism:Homo sapiens (Human)
Description:The recombinant human PKC enzymes were produced using a baculovirus expression system in SF9 cells
Residue:672
BDBM50073874
NameBDBM50073874
Synonyms:(4S,5aS,9aS)-7,7-Dibutyl-4-hydroxymethyl-5a-methyl-decahydro-benzo[d]azepin-2-one | CHEMBL49902
TypeSmall organic molecule
Emp. Form.C20H37NO2
Mol. Mass.323.5133
SMILESCCCCC1(CCCC)CC[C@H]2CC(=O)N[C@H](CO)C[C@]2(C)C1