Reaction Details
TargetProtein kinase C alpha type
LigandBDBM50073872
Substrate/Competitorn/a
Meas. Tech.ChEBML_160134
Ki>500±n/a nM
Citation Endo, YShimazu, MFukasawa, HDriedger, PEKimura, KTomioka, NItai, AShudo, K Synthesis, computer modeling and biological evaluation of novel protein kinase C agonists based on a 7-membered lactam moiety. Bioorg Med Chem Lett9:173-8 (1999) Protein kinase C alpha type
Name:Protein kinase C alpha type
Type:Enzyme
Mol. Mass.:76755.65
Organism:Homo sapiens (Human)
Description:The recombinant human PKC enzymes were produced using a baculovirus expression system in SF9 cells
Residue:672
BDBM50073872
NameBDBM50073872
Synonyms:(4S,5aS,5bS,7aS,10aS,10bS,12aS)-4-Hydroxymethyl-5a,7a-dimethyl-hexadecahydro-cyclopenta[5,6]naphtho[1,2-d]azepin-2-one | CHEMBL48622
TypeSmall organic molecule
Emp. Form.C20H33NO2
Mol. Mass.319.4815
SMILESC[C@@]12CCC[C@H]1[C@@H]1CC[C@H]3CC(=O)N[C@H](CO)C[C@]3(C)[C@H]1CC2