Reaction Details
TargetAlpha-1D adrenergic receptor
LigandBDBM50074012
Substrate/Competitorn/a
Meas. Tech.ChEBML_32427
Ki 24±n/a nM
Citation Nerenberg, JBErb, JMBergman, JMO'Malley, SChang, RSScott, ALBroten, TPBock, MG 4-Oxospiro[benzopyran-2,4'-piperidines] as selective alpha 1a-adrenergic receptor antagonists. Bioorg Med Chem Lett9:291-4 (1999) Alpha-1D adrenergic receptor
Name:Alpha-1D adrenergic receptor
Type:Enzyme Catalytic Domain
Mol. Mass.:60485.82
Organism:Homo sapiens (Human)
Description:adrenergic Alpha1D ADRA1D HUMAN::P25100
Residue:572
BDBM50074012
NameBDBM50074012
Synonyms:6-(1-methyl-1H-4-imidazolylsulfonamido)-1'-[2-(1-naphthyl)ethyl]-4-oxospiro[3,4-dihydro-2H-chromene-2,4'-(hexahydropyridine)] | CHEMBL101579
TypeSmall organic molecule
Emp. Form.C29H30N4O4S
Mol. Mass.530.638
SMILESCn1cnc(c1)S(=O)(=O)Nc1ccc2OC3(CCN(CCc4cccc5ccccc45)CC3)CC(=O)c2c1