Reaction Details
TargetAdenosine receptor A3
LigandBDBM50074225
Substrate/Competitorn/a
Meas. Tech.ChEMBL_31865 (CHEMBL644094)
Ki 18.9±n/a nM
Citation Li, AHMoro, SForsyth, NMelman, NJi, XDJacobson, KA Synthesis, CoMFA analysis, and receptor docking of 3,5-diacyl-2, 4-dialkylpyridine derivatives as selective A3 adenosine receptor antagonists. J Med Chem42:706-21 (1999) 
 
Adenosine receptor A3
Name:Adenosine receptor A3
Type:G Protein-Coupled Receptor (GPCR)
Mol. Mass.:36197.32
Organism:Homo sapiens (Human)
Description:P0DMS8
Residue:318
BDBM50074225
NameBDBM50074225
Synonyms:6-Ethyl-5-ethylsulfanylcarbonyl-2-phenyl-4-propyl-nicotinic acid propyl ester | CHEMBL111545
TypeSmall organic molecule
Emp. Form.C23H29NO3S
Mol. Mass.399.546
SMILESCCCOC(=O)c1c(CCC)c(C(=O)SCC)c(CC)nc1-c1ccccc1