Reaction Details
TargetRetinoic acid receptor RXR-gamma
LigandBDBM50074297
Substrate/Competitorn/a
Meas. Tech.ChEMBL_197240 (CHEMBL803362)
Ki 14±n/a nM
Citation Canan Koch, SSDardashti, LJCesario, RMCroston, GEBoehm, MFHeyman, RANadzan, AM Synthesis of retinoid X receptor-specific ligands that are potent inducers of adipogenesis in 3T3-L1 cells. J Med Chem42:742-50 (1999) 
 
Retinoic acid receptor RXR-gamma
Name:Retinoic acid receptor RXR-gamma
Type:PROTEIN
Mol. Mass.:50878.26
Organism:Homo sapiens (Human)
Description:ChEMBL_197216
Residue:463
BDBM50074297
NameBDBM50074297
Synonyms:4-[[(E)-Cyanomethoxyimino]-(3,5,5,8,8-pentamethyl-5,6,7,8-tetrahydro-naphthalen-2-yl)-methyl]-benzoic acid | CHEMBL164902
TypeSmall organic molecule
Emp. Form.C25H28N2O3
Mol. Mass.404.5014
SMILESCc1cc2c(cc1\C(=N\OCC#N)c1ccc(cc1)C(O)=O)C(C)(C)CCC2(C)C