Reaction Details
TargetRetinoic acid receptor RXR-alpha
LigandBDBM50074307
Substrate/Competitorn/a
Meas. Tech.ChEMBL_196913 (CHEMBL807375)
Ki 6±n/a nM
Citation Canan Koch, SSDardashti, LJCesario, RMCroston, GEBoehm, MFHeyman, RANadzan, AM Synthesis of retinoid X receptor-specific ligands that are potent inducers of adipogenesis in 3T3-L1 cells. J Med Chem42:742-50 (1999) 
 
Retinoic acid receptor RXR-alpha
Name:Retinoic acid receptor RXR-alpha
Type:PROTEIN
Mol. Mass.:50820.38
Organism:Homo sapiens (Human)
Description:ChEMBL_1456363
Residue:462
BDBM50074307
NameBDBM50074307
Synonyms:4-{(3,5,5,8,8-Pentamethyl-5,6,7,8-tetrahydro-naphthalen-2-yl)-[(E)-propoxyimino]-methyl}-benzoic acid | CHEMBL165734
TypeSmall organic molecule
Emp. Form.C26H33NO3
Mol. Mass.407.5451
SMILESCCCO\N=C(/c1ccc(cc1)C(O)=O)c1cc2c(cc1C)C(C)(C)CCC2(C)C