Reaction Details
TargetCorticotropin-releasing factor receptor 1
LigandBDBM50074500
Substrate/Competitorn/a
Meas. Tech.ChEMBL_51114 (CHEMBL664960)
Ki 1.5±n/a nM
Citation Chorvat, RJBakthavatchalam, RBeck, JPGilligan, PJWilde, RGCocuzza, AJHobbs, FWCheeseman, RSCurry, MRescinito, JPKrenitsky, PChidester, DYarem, JAKlaczkiewicz, JDHodge, CNAldrich, PEWasserman, ZRFernandez, CHZaczek, RFitzgerald, LWHuang, SMShen, HLWong, YNChien, BMArvanitis, A Synthesis, corticotropin-releasing factor receptor binding affinity, and pharmacokinetic properties of triazolo-, imidazo-, and pyrrolopyrimidines and -pyridines. J Med Chem42:833-48 (1999) 
 
Corticotropin-releasing factor receptor 1
Name:Corticotropin-releasing factor receptor 1
Type:Enzyme
Mol. Mass.:50744.31
Organism:Homo sapiens (Human)
Description:P34998
Residue:444
BDBM50074500
NameBDBM50074500
Synonyms:3-(2-Bromo-4-isopropyl-phenyl)-7-(1-ethyl-pentyloxy)-5-methyl-3H-[1,2,3]triazolo[4,5-d]pyrimidine | CHEMBL355214
TypeSmall organic molecule
Emp. Form.C21H28BrN5O
Mol. Mass.446.384
SMILESCCCCC(CC)Oc1nc(C)nc2n(nnc12)-c1ccc(cc1Br)C(C)C