Reaction Details
TargetCorticotropin-releasing factor receptor 1
LigandBDBM50074522
Substrate/Competitorn/a
Meas. Tech.ChEMBL_51114 (CHEMBL664960)
Ki 3.5±n/a nM
Citation Chorvat, RJBakthavatchalam, RBeck, JPGilligan, PJWilde, RGCocuzza, AJHobbs, FWCheeseman, RSCurry, MRescinito, JPKrenitsky, PChidester, DYarem, JAKlaczkiewicz, JDHodge, CNAldrich, PEWasserman, ZRFernandez, CHZaczek, RFitzgerald, LWHuang, SMShen, HLWong, YNChien, BMArvanitis, A Synthesis, corticotropin-releasing factor receptor binding affinity, and pharmacokinetic properties of triazolo-, imidazo-, and pyrrolopyrimidines and -pyridines. J Med Chem42:833-48 (1999) 
 
Corticotropin-releasing factor receptor 1
Name:Corticotropin-releasing factor receptor 1
Type:Enzyme
Mol. Mass.:50744.31
Organism:Homo sapiens (Human)
Description:P34998
Residue:444
BDBM50074522
NameBDBM50074522
Synonyms:CHEMBL354940 | [9-(2-Bromo-4,6-dimethoxy-phenyl)-2-methyl-9H-purin-6-yl]-butyl-ethyl-amine
TypeSmall organic molecule
Emp. Form.C20H26BrN5O2
Mol. Mass.448.357
SMILESCCCCN(CC)c1nc(C)nc2n(cnc12)-c1c(Br)cc(OC)cc1OC