Reaction Details
TargetChymotrypsin-like elastase family member 2A
LigandBDBM50075106
Substrate/Competitorn/a
Meas. Tech.ChEBML_158076
IC50 64±n/a nM
Citation Iijima, KKatada, JHayashi, Y Symmetrical anhydride-type serine protease inhibitors: structure-activity relationship studies of human chymase inhibitors. Bioorg Med Chem Lett9:413-8 (1999) Chymotrypsin-like elastase family member 2A
Name:Chymotrypsin-like elastase family member 2A
Type:PROTEIN
Mol. Mass.:28705.23
Organism:Sus scrofa
Description:ChEMBL_156951
Residue:269
BDBM50075106
NameBDBM50075106
Synonyms:1,1-dimethyl-4-phenyl-2-phenylcarboxamidopentanoic anhydride | CHEMBL134821
TypeSmall organic molecule
Emp. Form.C40H44N2O5
Mol. Mass.632.7878
SMILESCC(C)(C(CCc1ccccc1)NC(=O)c1ccccc1)C(=O)OC(=O)C(C)(C)C(CCc1ccccc1)NC(=O)c1ccccc1