Reaction Details
TargetChymase
LigandBDBM50075109
Substrate/Competitorn/a
Meas. Tech.ChEBML_220724
IC50 5±n/a nM
Citation Iijima, KKatada, JHayashi, Y Symmetrical anhydride-type serine protease inhibitors: structure-activity relationship studies of human chymase inhibitors. Bioorg Med Chem Lett9:413-8 (1999) Chymase
Name:Chymase
Type:Enzyme
Mol. Mass.:27340.12
Organism:Homo sapiens (Human)
Description:n/a
Residue:247
BDBM50075109
NameBDBM50075109
Synonyms:1,1-dimethyl-2-phenylcarboxamidoheptanoic anhydride | CHEMBL335675
TypeSmall organic molecule
Emp. Form.C32H44N2O5
Mol. Mass.536.7022
SMILESCCCCC(NC(=O)c1ccccc1)C(C)(C)C(=O)OC(=O)C(C)(C)C(CCCC)NC(=O)c1ccccc1