Reaction Details
TargetSerine protease 1
LigandBDBM50075109
Substrate/Competitorn/a
Meas. Tech.ChEMBL_158244 (CHEMBL762426)
IC50 2900±n/a nM
Citation Iijima, KKatada, JHayashi, Y Symmetrical anhydride-type serine protease inhibitors: structure-activity relationship studies of human chymase inhibitors. Bioorg Med Chem Lett9:413-8 (1999) Serine protease 1
Name:Serine protease 1
Type:Enzyme
Mol. Mass.:26557.80
Organism:Homo sapiens (Human)
Description:P07477
Residue:247
BDBM50075109
NameBDBM50075109
Synonyms:1,1-dimethyl-2-phenylcarboxamidoheptanoic anhydride | CHEMBL335675
TypeSmall organic molecule
Emp. Form.C32H44N2O5
Mol. Mass.536.7022
SMILESCCCCC(NC(=O)c1ccccc1)C(C)(C)C(=O)OC(=O)C(C)(C)C(CCCC)NC(=O)c1ccccc1