Reaction Details
TargetCathepsin G
LigandBDBM50075109
Substrate/Competitorn/a
Meas. Tech.ChEBML_45350
IC50 6.4±n/a nM
Citation Iijima, KKatada, JHayashi, Y Symmetrical anhydride-type serine protease inhibitors: structure-activity relationship studies of human chymase inhibitors. Bioorg Med Chem Lett9:413-8 (1999) Cathepsin G
Name:Cathepsin G
Type:PROTEIN
Mol. Mass.:28860.08
Organism:Homo sapiens (Human)
Description:ChEMBL_1469016
Residue:255
BDBM50075109
NameBDBM50075109
Synonyms:1,1-dimethyl-2-phenylcarboxamidoheptanoic anhydride | CHEMBL335675
TypeSmall organic molecule
Emp. Form.C32H44N2O5
Mol. Mass.536.7022
SMILESCCCCC(NC(=O)c1ccccc1)C(C)(C)C(=O)OC(=O)C(C)(C)C(CCCC)NC(=O)c1ccccc1