Reaction Details
TargetChymotrypsin-like elastase family member 2A
LigandBDBM50075104
Substrate/Competitorn/a
Meas. Tech.ChEBML_158076
IC50 180±n/a nM
Citation Iijima, KKatada, JHayashi, Y Symmetrical anhydride-type serine protease inhibitors: structure-activity relationship studies of human chymase inhibitors. Bioorg Med Chem Lett9:413-8 (1999) Chymotrypsin-like elastase family member 2A
Name:Chymotrypsin-like elastase family member 2A
Type:PROTEIN
Mol. Mass.:28705.23
Organism:Sus scrofa
Description:ChEMBL_156951
Residue:269
BDBM50075104
NameBDBM50075104
Synonyms:1,1-dimethyl-2-phenylcarboxamidononanoic anhydride | CHEMBL135080
TypeSmall organic molecule
Emp. Form.C36H52N2O5
Mol. Mass.592.8085
SMILESCCCCCCC(NC(=O)c1ccccc1)C(C)(C)C(=O)OC(=O)C(C)(C)C(CCCCCC)NC(=O)c1ccccc1