Reaction Details
TargetNeuropeptide Y receptor type 1
LigandBDBM50075263
Substrate/Competitorn/a
Meas. Tech.ChEBML_143829
Ki 11±n/a nM
Citation Britton, TCSpinazze, PGHipskind, PAZimmerman, DMZarrinmayeh, HSchober, DAGehlert, DRBruns, RF Structure-activity relationships of a series of benzothiophene-derived NPY Y1 antagonists: optimization of the C-2 side chain. Bioorg Med Chem Lett9:475-80 (1999) Neuropeptide Y receptor type 1
Name:Neuropeptide Y receptor type 1
Type:Enzyme Catalytic Domain
Mol. Mass.:44399.07
Organism:Homo sapiens (Human)
Description:NPY-Y1 NPY1R HUMAN::P25929
Residue:384
BDBM50075263
NameBDBM50075263
Synonyms:(1-{2-[2-(4-Bromo-2-methoxymethyl-phenoxymethyl)-benzo[b]thiophen-3-yl]-ethyl}-piperidin-4-yl)-dimethyl-amine | CHEMBL357914
TypeSmall organic molecule
Emp. Form.C26H33BrN2O2S
Mol. Mass.517.521
SMILESCOCc1cc(Br)ccc1OCc1sc2ccccc2c1CCN1CCC(CC1)N(C)C