Reaction Details
TargetReverse transcriptase/RNaseH
LigandBDBM50075316
Substrate/Competitorn/a
Meas. Tech.ChEBML_80267
Ki 490±n/a nM
Citation Zembower, DEAytes, SA Synthesis of 5,8-dimethoxy-3-hydroxy-4-quinolone, a reported inhibitor of HIV RT, and evidence the original proposed structure was incorrect. Bioorg Med Chem Lett9:543-6 (1999) Reverse transcriptase/RNaseH
Name:Reverse transcriptase/RNaseH
Type:PROTEIN
Mol. Mass.:65229.15
Organism:Human immunodeficiency virus 1
Description:ChEMBL_1473730
Residue:566
BDBM50075316
NameBDBM50075316
Synonyms:3,5,8-Trihydroxy-1H-quinolin-4-one | CHEMBL153724
TypeSmall organic molecule
Emp. Form.C9H7NO4
Mol. Mass.193.1562
SMILESOc1cnc2c(O)ccc(O)c2c1O