Reaction Details
Target4-hydroxyphenylpyruvate dioxygenase
LigandBDBM50075317
Substrate/Competitorn/a
Meas. Tech.ChEMBL_549 (CHEMBL615569)
Ki 300000±n/a nM
Citation Lin, SYang, D Inhibition of 4-hydroxyphenylpyruvate dioxygenase by sethoxydim, a potent inhibitor of acetyl-coenzyme A carboxylase. Bioorg Med Chem Lett9:551-4 (1999) 4-hydroxyphenylpyruvate dioxygenase
Name:4-hydroxyphenylpyruvate dioxygenase
Type:PROTEIN
Mol. Mass.:45064.25
Organism:Sus scrofa
Description:ChEMBL_541
Residue:393
BDBM50075317
NameBDBM50075317
Synonyms:2-{1-[(E)-Ethoxyimino]-butyl}-5-(2-ethylsulfanyl-propyl)-3-hydroxy-cyclohex-2-enone | CHEMBL326563
TypeSmall organic molecule
Emp. Form.C17H29NO3S
Mol. Mass.327.482
SMILESCCC\C(=N/OCC)C1C(=O)CC(CC(C)SCC)CC1=O