Reaction Details
TargetD(3) dopamine receptor
LigandBDBM50075362
Substrate/Competitorn/a
Meas. Tech.ChEBML_58773
Ki 1300±n/a nM
Citation Curtis, NRKulagowski, JJLeeson, PDRidgill, MPEmms, FFreedman, SBPatel, SPatel, S Synthesis and sar of 2- and 3-substituted 7-azaindoles as potential dopamine D4 ligands. Bioorg Med Chem Lett9:585-8 (1999) D(3) dopamine receptor
Name:D(3) dopamine receptor
Type:n/a
Mol. Mass.:44243.43
Organism:Homo sapiens (Human)
Description:n/a
Residue:400
BDBM50075362
NameBDBM50075362
Synonyms:3-(4-Phenethyl-piperidin-1-ylmethyl)-1H-pyrrolo[2,3-b]pyridine | CHEMBL155207
TypeSmall organic molecule
Emp. Form.C21H25N3
Mol. Mass.319.4433
SMILESC(Cc1ccccc1)C1CCN(Cc2c[nH]c3ncccc23)CC1