Reaction Details
TargetD(4) dopamine receptor
LigandBDBM50075363
Substrate/Competitorn/a
Meas. Tech.ChEBML_58929
Ki 7±n/a nM
Citation Curtis, NRKulagowski, JJLeeson, PDRidgill, MPEmms, FFreedman, SBPatel, SPatel, S Synthesis and sar of 2- and 3-substituted 7-azaindoles as potential dopamine D4 ligands. Bioorg Med Chem Lett9:585-8 (1999) D(4) dopamine receptor
Name:D(4) dopamine receptor
Type:Enzyme
Mol. Mass.:48373.19
Organism:Homo sapiens (Human)
Description:P21917
Residue:419
BDBM50075363
NameBDBM50075363
Synonyms:2-(1H-Pyrrolo[2,3-b]pyridin-3-ylmethyl)-1,2,3,4-tetrahydro-isoquinoline | CHEMBL154286
TypeSmall organic molecule
Emp. Form.C17H17N3
Mol. Mass.263.337
SMILESC(N1CCc2ccccc2C1)c1c[nH]c2ncccc12