Reaction Details
TargetGenome polyprotein
LigandBDBM11229
Substrate/Competitorn/a
Meas. Tech.ChEMBL_161099 (CHEMBL771560)
EC50 10±n/a nM
Citation Dragovich, PSPrins, TJZhou, RWebber, SEMarakovits, JTFuhrman, SAPatick, AKMatthews, DALee, CAFord, CEBurke, BJRejto, PAHendrickson, TFTuntland, TBrown, ELMeador, JWFerre, RAHarr, JEKosa, MBWorland, ST Structure-based design, synthesis, and biological evaluation of irreversible human rhinovirus 3C protease inhibitors. 4. Incorporation of P1 lactam moieties as L-glutamine replacements. J Med Chem42:1213-24 (1999) 
 
Genome polyprotein
Name:Genome polyprotein
Type:PROTEIN
Mol. Mass.:44361.04
Organism:Human rhinovirus B
Description:ChEMBL_158953
Residue:401
BDBM11229
NameBDBM11229
Synonyms:AG7088 analogue 2a N-[(5-methylisoxazol-3-yl)carbonyl]-L-valyl-N-((1S,2E)-4-ethoxy-4-oxo-1-{[(3S)-2-oxopyrrolidin-3-yl]methyl}but-2-enyl)-4-fluoro-L-phenylalaninamide ethyl (2E,4S)-4-[(2S)-3-(4-fluorophenyl)-2-[(2S)-3-methyl-2-[(5-methyl-1,2-oxazol-3-yl)formamido]butanamido]propanamido]-5-[(3S)-2-oxopyrrolidin-3-yl]pent-2-enoate
TypeSmall organic molecule
Emp. Form.C30H38FN5O7
Mol. Mass.599.6504
SMILESCCOC(=O)\C=C\[C@H](C[C@@H]1CCNC1=O)NC(=O)[C@H](Cc1ccc(F)cc1)NC(=O)[C@@H](NC(=O)c1cc(C)on1)C(C)C