Reaction Details
TargetThromboxane A2 receptor
LigandBDBM50075641
Substrate/Competitorn/a
Meas. Tech.ChEMBL_209591 (CHEMBL814726)
IC50 7.0±n/a nM
Citation Soyka, RGuth, BDWeisenberger, HMLuger, PMüller, TH Guanidine derivatives as combined thromboxane A2 receptor antagonists and synthase inhibitors. J Med Chem42:1235-49 (1999) 
 
Thromboxane A2 receptor
Name:Thromboxane A2 receptor
Type:Enyzme
Mol. Mass.:37445.28
Organism:Homo sapiens (Human)
Description:P21731
Residue:343
BDBM50075641
NameBDBM50075641
Synonyms:6-{3-[2-cyano-1-isobutylamino-(E)-1-iminomethylamino]phenyl}-6-(3-pyridyl)-(E)-5-hexenoic acid | CHEMBL21513
TypeSmall organic molecule
Emp. Form.C23H27N5O2
Mol. Mass.405.4928
SMILESCC(C)CNC(Nc1cccc(c1)C(=CCCCC(O)=O)c1cccnc1)=NC#N