Reaction Details
TargetThromboxane-A synthase
LigandBDBM50075645
Substrate/Competitorn/a
Meas. Tech.ChEMBL_209930 (CHEMBL813721)
IC50 3±n/a nM
Citation Soyka, RGuth, BDWeisenberger, HMLuger, PMüller, TH Guanidine derivatives as combined thromboxane A2 receptor antagonists and synthase inhibitors. J Med Chem42:1235-49 (1999) 
 
Thromboxane-A synthase
Name:Thromboxane-A synthase
Type:Enzyme
Mol. Mass.:60524.67
Organism:Homo sapiens (Human)
Description:P24557
Residue:533
BDBM50075645
NameBDBM50075645
Synonyms:6-{3-[2-cyano-1-cyclohexylamino-(E)-1-iminomethylamino]phenyl}-6-(3-pyridyl)-(E)-5-hexenoic acid | CHEMBL282884
TypeSmall organic molecule
Emp. Form.C25H29N5O2
Mol. Mass.431.5301
SMILESOC(=O)CCCC=C(c1cccnc1)c1cccc(NC(NC2CCCCC2)=NC#N)c1