Reaction Details
TargetAmine oxidase [flavin-containing] B
LigandBDBM50521202
Substrate/Competitorn/a
Meas. Tech.ChEMBL_1883540 (CHEMBL4385039)
Ki 0.500000±n/a nM
Citation Tzvetkov, NTStammler, HGHristova, SAtanasov, AGAntonov, L (Pyrrolo-pyridin-5-yl)benzamides: BBB permeable monoamine oxidase B inhibitors with neuroprotective effect on cortical neurons. Eur J Med Chem162:793-809 (2019) 
 
Amine oxidase [flavin-containing] B
Name:Amine oxidase [flavin-containing] B
Type:Protein
Mol. Mass.:58768.76
Organism:Homo sapiens (Human)
Description:P27338
Residue:520
BDBM50521202
NameBDBM50521202
Synonyms:CHEMBL4450595
TypeSmall organic molecule
Emp. Form.C14H9Cl2N3O
Mol. Mass.306.147
SMILESClc1ccc(cc1Cl)C(=O)Nc1ccc2[nH]ccc2n1