Reaction Details
TargetMuscarinic acetylcholine receptor M2
LigandBDBM50076088
Substrate/Competitorn/a
Meas. Tech.ChEBML_140092
Ki 26±n/a nM
Citation Doller, DChackalamannil, SCzarniecki, MMcQuade, RRuperto, V Design, synthesis, and structure-activity relationship studies of himbacine derived muscarinic receptor antagonists. Bioorg Med Chem Lett9:901-6 (1999) Muscarinic acetylcholine receptor M2
Name:Muscarinic acetylcholine receptor M2
Type:GPCR
Mol. Mass.:51730.61
Organism:Homo sapiens (Human)
Description:P08172
Residue:466
BDBM50076088
NameBDBM50076088
Synonyms:(3S,3aR,4R,4aS,8aR,9aS)-4-[3-(Adamantan-1-ylamino)-propyl]-3-methyl-decahydro-naphtho[2,3-c]furan-1-one | CHEMBL353311
TypeSmall organic molecule
Emp. Form.C26H41NO2
Mol. Mass.399.6092
SMILESC[C@@H]1OC(=O)[C@H]2C[C@H]3CCCC[C@@H]3[C@@H](CCCNC34CC5CC(CC(C5)C3)C4)[C@@H]12