Reaction Details
TargetSerine protease 1
LigandBDBM50076227
Substrate/Competitorn/a
Meas. Tech.ChEMBL_212323 (CHEMBL818250)
Ki 0.027±n/a nM
Citation Boatman, PDOgbu, COEguchi, MKim, HONakanishi, HCao, BShea, JPKahn, M Secondary structure peptide mimetics: design, synthesis, and evaluation of beta-strand mimetic thrombin inhibitors. J Med Chem42:1367-75 (1999) 
 
Serine protease 1
Name:Serine protease 1
Type:Enzyme
Mol. Mass.:25790.52
Organism:Bos taurus (bovine)
Description:P00760
Residue:246
BDBM50076227
NameBDBM50076227
Synonyms:(1S,7S)-7-Amino-7-benzyl-hexahydro-pyrazolo[1,2-a]pyridazine-1-carboxylic acid ((S)-4-guanidino-1-phenethylaminooxalyl-butyl)-amide | CHEMBL28817
TypeSmall organic molecule
Emp. Form.C30H42N8O3
Mol. Mass.562.7063
SMILESNC(=N)NCCC[C@H](NC(=O)[C@@H]1CCN2CC[C@@](N)(Cc3ccccc3)CN12)C(=O)C(=O)NCCc1ccccc1