Reaction Details
TargetProthrombin
LigandBDBM50076229
Substrate/Competitorn/a
Meas. Tech.ChEMBL_208313 (CHEMBL812832)
Ki 2.4±n/a nM
Citation St Charles, RMatthews, JHZhang, ETulinsky, A Bound structures of novel P3-P1' beta-strand mimetic inhibitors of thrombin. J Med Chem42:1376-83 (1999) 
 
Prothrombin
Name:Prothrombin
Type:Protein
Mol. Mass.:70029.57
Organism:Homo sapiens (Human)
Description:P00734
Residue:622
BDBM50076229
NameBDBM50076229
Synonyms:(1S,7S)-7-Amino-7-benzyl-8-oxo-hexahydro-pyrazolo[1,2-a]pyridazine-1-carboxylic acid [(S)-4-guanidino-1-(thiazole-2-carbonyl)-butyl]-amide CHEMBL32182
TypeSmall organic molecule
Emp. Form.C24H32N8O3S
Mol. Mass.512.628
SMILESNC(=N)NCCC[C@H](NC(=O)[C@@H]1CCN2CC[C@@](N)(Cc3ccccc3)C(=O)N12)C(=O)c1nccs1