Reaction Details
TargetStromelysin-1
LigandBDBM50241372
Substrate/Competitorn/a
Meas. Tech.ChEMBL_104736 (CHEMBL710736)
Ki 710±n/a nM
Citation Jacobsen, EJMitchell, MAHendges, SKBelonga, KLSkaletzky, LLStelzer, LSLindberg, TJFritzen, ELSchostarez, HJO'Sullivan, TJMaggiora, LLStuchly, CWLaborde, ALKubicek, MFPoorman, RABeck, JMMiller, HRPetzold, GLScott, PSTruesdell, SEWallace, TLWilks, JWFisher, CGoodman, LVKaytes, PS Synthesis of a series of stromelysin-selective thiadiazole urea matrix metalloproteinase inhibitors. J Med Chem42:1525-36 (1999) 
 
Stromelysin-1
Name:Stromelysin-1
Type:Enzyme
Mol. Mass.:53973.13
Organism:Homo sapiens (Human)
Description: P08254
Residue:477
BDBM50241372
NameBDBM50241372
Synonyms:(S)-1-(1-(methylamino)-1-oxo-3-phenylpropan-2-yl)-3-(5-thioxo-4,5-dihydro-1,3,4-thiadiazol-2-yl)urea 2-[3-(5-MERCAPTO-[1,3,4]THIADIAZOL-2-YL)-UREIDO]-N-METHYL-3-PHENYL-PROPIONAMIDE PNU-107859
TypeSmall organic molecule
Emp. Form.C13H15N5O2S2
Mol. Mass.337.421
SMILESCNC(=O)[C@H](Cc1ccccc1)NC(=O)Nc1nnc(S)s1