Reaction Details
TargetStromelysin-1
LigandBDBM50076354
Substrate/Competitorn/a
Meas. Tech.ChEMBL_104736 (CHEMBL710736)
Ki 860.0±n/a nM
Citation Jacobsen, EJMitchell, MAHendges, SKBelonga, KLSkaletzky, LLStelzer, LSLindberg, TJFritzen, ELSchostarez, HJO'Sullivan, TJMaggiora, LLStuchly, CWLaborde, ALKubicek, MFPoorman, RABeck, JMMiller, HRPetzold, GLScott, PSTruesdell, SEWallace, TLWilks, JWFisher, CGoodman, LVKaytes, PS Synthesis of a series of stromelysin-selective thiadiazole urea matrix metalloproteinase inhibitors. J Med Chem42:1525-36 (1999) 
 
Stromelysin-1
Name:Stromelysin-1
Type:Enzyme
Mol. Mass.:53973.13
Organism:Homo sapiens (Human)
Description: P08254
Residue:477
BDBM50076354
NameBDBM50076354
Synonyms:1-[(S)-1-Benzyl-2-(4-benzyl-piperazin-1-yl)-2-oxo-ethyl]-3-(5-thioxo-4,5-dihydro-[1,3,4]thiadiazol-2-yl)-urea | CHEMBL290704
TypeSmall organic molecule
Emp. Form.C23H26N6O2S2
Mol. Mass.482.622
SMILESSc1nnc(NC(=O)N[C@@H](Cc2ccccc2)C(=O)N2CCN(Cc3ccccc3)CC2)s1