Reaction Details
TargetStromelysin-1
LigandBDBM50076372
Substrate/Competitorn/a
Meas. Tech.ChEMBL_104736 (CHEMBL710736)
Ki 14±n/a nM
Citation Jacobsen, EJMitchell, MAHendges, SKBelonga, KLSkaletzky, LLStelzer, LSLindberg, TJFritzen, ELSchostarez, HJO'Sullivan, TJMaggiora, LLStuchly, CWLaborde, ALKubicek, MFPoorman, RABeck, JMMiller, HRPetzold, GLScott, PSTruesdell, SEWallace, TLWilks, JWFisher, CGoodman, LVKaytes, PS Synthesis of a series of stromelysin-selective thiadiazole urea matrix metalloproteinase inhibitors. J Med Chem42:1525-36 (1999) 
 
Stromelysin-1
Name:Stromelysin-1
Type:Enzyme
Mol. Mass.:53973.13
Organism:Homo sapiens (Human)
Description: P08254
Residue:477
BDBM50076372
NameBDBM50076372
Synonyms:1-[(S)-2-Oxo-1-pentafluorophenylmethyl-2-(4-pyridin-2-yl-piperazin-1-yl)-ethyl]-3-(5-thioxo-4,5-dihydro-[1,3,4]thiadiazol-2-yl)-urea | CHEMBL38900
TypeSmall organic molecule
Emp. Form.C21H18F5N7O2S2
Mol. Mass.559.535
SMILESFc1c(F)c(F)c(C[C@H](NC(=O)Nc2nnc(S)s2)C(=O)N2CCN(CC2)c2ccccn2)c(F)c1F