Reaction Details
TargetInterstitial collagenase
LigandBDBM50076363
Substrate/Competitorn/a
Meas. Tech.ChEMBL_106319 (CHEMBL714731)
Ki 6000±n/a nM
Citation Jacobsen, EJMitchell, MAHendges, SKBelonga, KLSkaletzky, LLStelzer, LSLindberg, TJFritzen, ELSchostarez, HJO'Sullivan, TJMaggiora, LLStuchly, CWLaborde, ALKubicek, MFPoorman, RABeck, JMMiller, HRPetzold, GLScott, PSTruesdell, SEWallace, TLWilks, JWFisher, CGoodman, LVKaytes, PS Synthesis of a series of stromelysin-selective thiadiazole urea matrix metalloproteinase inhibitors. J Med Chem42:1525-36 (1999) 
 
Interstitial collagenase
Name:Interstitial collagenase
Type:Enzyme
Mol. Mass.:54010.26
Organism:Homo sapiens (Human)
Description: P03956
Residue:469
BDBM50076363
NameBDBM50076363
Synonyms:1-{(S)-1-Benzyl-2-[4-(4-methoxy-phenyl)-piperazin-1-yl]-2-oxo-ethyl}-3-(5-thioxo-4,5-dihydro-[1,3,4]thiadiazol-2-yl)-urea | CHEMBL264053
TypeSmall organic molecule
Emp. Form.C23H26N6O3S2
Mol. Mass.498.621
SMILESCOc1ccc(cc1)N1CCN(CC1)C(=O)[C@H](Cc1ccccc1)NC(=O)Nc1nnc(S)s1