Reaction Details
TargetStromelysin-1
LigandBDBM50076366
Substrate/Competitorn/a
Meas. Tech.ChEMBL_104736 (CHEMBL710736)
Ki 330±n/a nM
Citation Jacobsen, EJMitchell, MAHendges, SKBelonga, KLSkaletzky, LLStelzer, LSLindberg, TJFritzen, ELSchostarez, HJO'Sullivan, TJMaggiora, LLStuchly, CWLaborde, ALKubicek, MFPoorman, RABeck, JMMiller, HRPetzold, GLScott, PSTruesdell, SEWallace, TLWilks, JWFisher, CGoodman, LVKaytes, PS Synthesis of a series of stromelysin-selective thiadiazole urea matrix metalloproteinase inhibitors. J Med Chem42:1525-36 (1999) 
 
Stromelysin-1
Name:Stromelysin-1
Type:Enzyme
Mol. Mass.:53973.13
Organism:Homo sapiens (Human)
Description: P08254
Residue:477
BDBM50076366
NameBDBM50076366
Synonyms:(S)-N-Methyl-3-(4-nitro-phenyl)-2-[3-(5-thioxo-4,5-dihydro-[1,3,4]thiadiazol-2-yl)-ureido]-propionamide | CHEMBL418063
TypeSmall organic molecule
Emp. Form.C13H14N6O4S2
Mol. Mass.382.418
SMILESCNC(=O)C(Cc1ccc(cc1)[N+]([O-])=O)NC(=O)Nc1n[n-]c(=[SH+])s1