Reaction Details
TargetInterstitial collagenase
LigandBDBM50076334
Substrate/Competitorn/a
Meas. Tech.ChEMBL_106319 (CHEMBL714731)
Ki 6200±n/a nM
Citation Jacobsen, EJMitchell, MAHendges, SKBelonga, KLSkaletzky, LLStelzer, LSLindberg, TJFritzen, ELSchostarez, HJO'Sullivan, TJMaggiora, LLStuchly, CWLaborde, ALKubicek, MFPoorman, RABeck, JMMiller, HRPetzold, GLScott, PSTruesdell, SEWallace, TLWilks, JWFisher, CGoodman, LVKaytes, PS Synthesis of a series of stromelysin-selective thiadiazole urea matrix metalloproteinase inhibitors. J Med Chem42:1525-36 (1999) 
 
Interstitial collagenase
Name:Interstitial collagenase
Type:Enzyme
Mol. Mass.:54010.26
Organism:Homo sapiens (Human)
Description: P03956
Residue:469
BDBM50076334
NameBDBM50076334
Synonyms:(S)-N-(3,4-Dimethoxy-benzyl)-3-phenyl-2-[3-(5-thioxo-4,5-dihydro-[1,3,4]thiadiazol-2-yl)-ureido]-propionamide | CHEMBL287974
TypeSmall organic molecule
Emp. Form.C21H23N5O4S2
Mol. Mass.473.568
SMILESCOc1ccc(CNC(=O)[C@H](Cc2ccccc2)NC(=O)Nc2nnc(S)s2)cc1OC