Reaction Details
TargetPolypeptide N-acetylgalactosaminyltransferase 2
LigandBDBM50214608
Substrate/Competitorn/a
Meas. Tech.ChEMBL_1885029 (CHEMBL4386611)
IC50>100000±n/a nM
Citation Liu, FCui, YYang, FXu, ZDa, LTZhang, Y Inhibition of polypeptide N-acetyl-?-galactosaminyltransferases is an underlying mechanism of dietary polyphenols preventing colorectal tumorigenesis. Bioorg Med Chem27:3372-3382 (2019) 
 
Polypeptide N-acetylgalactosaminyltransferase 2
Name:Polypeptide N-acetylgalactosaminyltransferase 2
Type:PROTEIN
Mol. Mass.:64746.16
Organism:Homo sapiens (Human)
Description:ChEMBL_115316
Residue:571
BDBM50214608
NameBDBM50214608
Synonyms:CHEMBL279564 | pyrene
TypeSmall organic molecule
Emp. Form.C16H10
Mol. Mass.202.2506
SMILESc1cc2ccc3cccc4ccc(c1)c2c34