Reaction Details
TargetCorticotropin-releasing factor receptor 1
LigandBDBM50076623
Substrate/Competitorn/a
Meas. Tech.ChEBML_50955
Ki 12±n/a nM
Citation Beck, JPArvanitis, AGCurry, MARescinito, JTFitzgerald, LWGilligan, PJZaczek, RTrainor, GL Purin-8-ones as corticotropin-releasing hormone (CRH-R1) receptor antagonists. Bioorg Med Chem Lett9:967-72 (1999) Corticotropin-releasing factor receptor 1
Name:Corticotropin-releasing factor receptor 1
Type:Enzyme
Mol. Mass.:50744.31
Organism:Homo sapiens (Human)
Description:P34998
Residue:444
BDBM50076623
NameBDBM50076623
Synonyms:9-(2-Bromo-4-isopropyl-phenyl)-6-[cyclopropylmethyl-(2-methoxy-ethyl)-amino]-2,7-dimethyl-7,9-dihydro-purin-8-one | CHEMBL172358
TypeSmall organic molecule
Emp. Form.C23H30BrN5O2
Mol. Mass.488.421
SMILESCOCCN(CC1CC1)c1nc(C)nc2n(-c3ccc(cc3Br)C(C)C)c(=O)n(C)c12