Reaction Details
TargetCorticotropin-releasing factor receptor 1
LigandBDBM50076782
Substrate/Competitorn/a
Meas. Tech.ChEBML_50977
Ki 2±n/a nM
Citation Cocuzza, AJChidester, DRCulp, SFitzgerald, LGilligan, P Use of the Suzuki reaction for the synthesis of aryl-substituted heterocycles as corticotropin-releasing hormone (CRH) antagonists. Bioorg Med Chem Lett9:1063-6 (1999) Corticotropin-releasing factor receptor 1
Name:Corticotropin-releasing factor receptor 1
Type:Enzyme
Mol. Mass.:50744.31
Organism:Homo sapiens (Human)
Description:P34998
Residue:444
BDBM50076782
NameBDBM50076782
Synonyms:CHEMBL10154 | N-Cyclopropylmethyl-N-ethyl-2,5-dimethyl-N'-(2,4,6-trichloro-phenyl)-pyrimidine-4,6-diamine
TypeSmall organic molecule
Emp. Form.C18H21Cl3N4
Mol. Mass.399.745
SMILESCCN(CC1CC1)c1nc(C)nc(Nc2c(Cl)cc(Cl)cc2Cl)c1C