Reaction Details
TargetCorticotropin-releasing factor receptor 1
LigandBDBM50074456
Substrate/Competitorn/a
Meas. Tech.ChEBML_50977
Ki 3.7±n/a nM
Citation Cocuzza, AJChidester, DRCulp, SFitzgerald, LGilligan, P Use of the Suzuki reaction for the synthesis of aryl-substituted heterocycles as corticotropin-releasing hormone (CRH) antagonists. Bioorg Med Chem Lett9:1063-6 (1999) Corticotropin-releasing factor receptor 1
Name:Corticotropin-releasing factor receptor 1
Type:Enzyme
Mol. Mass.:50744.31
Organism:Homo sapiens (Human)
Description:P34998
Residue:444
BDBM50074456
NameBDBM50074456
Synonyms:CHEMBL10504 [3-(2-Bromo-4-isopropyl-phenyl)-5-methyl-3H-[1,2,3]triazolo[4,5-d]pyrimidin-7-yl]-bis-(2-methoxy-ethyl)-amine
TypeSmall organic molecule
Emp. Form.C20H27BrN6O2
Mol. Mass.463.371
SMILESCOCCN(CCOC)c1nc(C)nc2n(nnc12)-c1ccc(cc1Br)C(C)C