Reaction Details
TargetCorticotropin-releasing factor receptor 1
LigandBDBM50074458
Substrate/Competitorn/a
Meas. Tech.ChEBML_50977
Ki 3.5±n/a nM
Citation Cocuzza, AJChidester, DRCulp, SFitzgerald, LGilligan, P Use of the Suzuki reaction for the synthesis of aryl-substituted heterocycles as corticotropin-releasing hormone (CRH) antagonists. Bioorg Med Chem Lett9:1063-6 (1999) Corticotropin-releasing factor receptor 1
Name:Corticotropin-releasing factor receptor 1
Type:Enzyme
Mol. Mass.:50744.31
Organism:Homo sapiens (Human)
Description:P34998
Residue:444
BDBM50074458
NameBDBM50074458
Synonyms:CHEMBL9633 | [3-(2-Bromo-4,6-dimethoxy-phenyl)-5-methyl-3H-[1,2,3]triazolo[4,5-d]pyrimidin-7-yl]-butyl-ethyl-amine
TypeSmall organic molecule
Emp. Form.C19H25BrN6O2
Mol. Mass.449.345
SMILESCCCCN(CC)c1nc(C)nc2n(nnc12)-c1c(Br)cc(OC)cc1OC