Reaction Details
TargetKappa-type opioid receptor
LigandBDBM50077066
Substrate/Competitorn/a
Meas. Tech.ChEBML_145808
IC50 1990±n/a nM
Citation Barn, DRBom, ACottney, JCaulfield, WLMorphy, JR Synthesis of novel analogues of the delta opioid ligand SNC-80 using AlCl3-promoted aminolysis. Bioorg Med Chem Lett9:1329-34 (1999) Kappa-type opioid receptor
Name:Kappa-type opioid receptor
Type:G Protein-Coupled Receptor (GPCR)
Mol. Mass.:42744.99
Organism:Cavia porcellus (domestic guinea pig)
Description:P41144
Residue:380
BDBM50077066
NameBDBM50077066
Synonyms:4-[(4-Allyl-piperazin-1-yl)-phenyl-methyl]-N,N-diethyl-benzamide CHEMBL544641
TypeSmall organic molecule
Emp. Form.C25H33N3O
Mol. Mass.391.549
SMILESCCN(CC)C(=O)c1ccc(cc1)C(N1CCN(CC=C)CC1)c1ccccc1